BDBM115181 (E)-N,N-dimethyl-4-(phenyldiazenyl)aniline::Methyl yellow (MY)
SMILES CN(C)c1ccc(cc1)\N=N\c1ccccc1
InChI Key InChIKey=JCYPECIVGRXBMO-FOCLMDBBSA-N
Data  2 IC50
  Tab Delimited (TSV)   2D SDfile   Computed 3D by Vconf -m prep SDfile
Find this compound or compounds like it in BindingDB:
Activity Spreadsheet -- Enzyme Inhibition Constant Data from BindingDB
Found 2 hits for monomerid = 115181
TargetAmine oxidase [flavin-containing] B(Homo sapiens (Human))
Northeast Ohio Medial University
LigandPNGBDBM115181((E)-N,N-dimethyl-4-(phenyldiazenyl)aniline | Methy...)
Affinity DataIC50:  14.6nMpH: 7.4Assay Description:The buffer system used was a 0.1 M phosphate buffer (pH 7.4). The assays were carried out in a fluorescent 96-well plate. The final concentrations of...
In DepthDetails ArticlePubMed
TargetAmine oxidase [flavin-containing] A(Homo sapiens (Human))
Northeast Ohio Medial University
LigandPNGBDBM115181((E)-N,N-dimethyl-4-(phenyldiazenyl)aniline | Methy...)
Affinity DataIC50:  4.64E+3nMpH: 7.4Assay Description:The buffer system used was a 0.1 M phosphate buffer (pH 7.4). The assays were carried out in a fluorescent 96-well plate. The final concentrations of...
In DepthDetails ArticlePubMed