BDBM115293 US8637500, 102
SMILES C(CN1CCCCC1)Nc1nccnc1Oc1ccc(Nc2ccccn2)cc1
InChI Key InChIKey=QHNXQDBGQQVWGT-UHFFFAOYSA-N
Data  1 IC50
  Tab Delimited (TSV)   2D SDfile   Computed 3D by Vconf -m prep SDfile
Find this compound or compounds like it in BindingDB:
Activity Spreadsheet -- Enzyme Inhibition Constant Data from BindingDB
Found 1 hit for monomerid = 115293
TargetcAMP and cAMP-inhibited cGMP 3',5'-cyclic phosphodiesterase 10A(Rattus norvegicus (rat))
Amgen
US Patent
LigandPNGBDBM115293(US8637500, 102)
Affinity DataIC50:  5.32E+3nMT: 2°C. Assay description: An IMAP TR-FRET assay was used to analyze the enzyme activity (Molecular Devices Corp., Sunnyvale Calif.). 5 μL of serial diluted PDE10A (BPS Bi...
In DepthDetails US Patent