BDBM115377 US9682940, 87
SMILES OC(=O)c1ccccc1S(=O)(=O)N1CCC(CC1)c1nn(C2CC2)c2ccc(cc12)C(c1ccc(Cl)cc1)c1ccc(Cl)cc1
InChI Key InChIKey=RXNAPXXJDSHPPZ-UHFFFAOYSA-N
Data  2 EC50
  Tab Delimited (TSV)   2D SDfile   Computed 3D by Vconf -m prep SDfile
Find this compound or compounds like it in BindingDB:
Activity Spreadsheet -- Enzyme Inhibition Constant Data from BindingDB
Found 2 hits for monomerid = 115377
TargetCannabinoid receptor 2(Homo sapiens (Human))
Janssen Pharmaceutica
US Patent
LigandPNGBDBM115377(US9682940, 87)
Affinity DataEC50: >1.00E+4nM. Assay description: CB1 and CB2 receptors are Gi-coupled GPCR. Activation of CB1 and CB2 receptors results in a decrease in cAMP production. An inverse agonist of the CB...
Ligand InfoPC cidPC sid
In DepthDetails US Patent
TargetCannabinoid receptor 1(Homo sapiens (Human))
Janssen Pharmaceutica
US Patent
LigandPNGBDBM115377(US9682940, 87)
Affinity DataEC50:  6.75E+3nM. Assay description: CB1 and CB2 receptors are Gi-coupled GPCR. Activation of CB1 and CB2 receptors results in a decrease in cAMP production. An inverse agonist of the CB...
Ligand InfoPC cidPC sid
In DepthDetails US Patent