BDBM115649 US8633183, D-24
SMILES CCc1ncnc(-c2ccc(C(=O)N3CCN(Cc4ccccc4)CC3)c(F)c2)c1C#Cc1ccc(N)nc1C
InChI Key InChIKey=GXZHOIBAJRXSBL-UHFFFAOYSA-N
Data  2 IC50
  Tab Delimited (TSV)   2D SDfile   Computed 3D by Vconf -m prep SDfile
Find this compound or compounds like it in BindingDB:
Activity Spreadsheet -- Enzyme Inhibition Constant Data from BindingDB
Found 2 hits for monomerid = 115649
TargetPhosphatidylinositol 4,5-bisphosphate 3-kinase catalytic subunit alpha isoform(Homo sapiens (Human))
Boehringer Ingelheim International
US Patent
LigandPNGBDBM115649(US8633183, D-24)
Affinity DataIC50:  1.02E+3nM. Assay description: PI3Kalpha assay described herein provides IC50 values indicating the activity of the compounds inhibiting PI3 kinase alpha activity Inhibition of PI3...
In DepthDetails US Patent
TargetSerine/threonine-protein kinase mTOR(Homo sapiens (Human))
Boehringer Ingelheim International
US Patent
LigandPNGBDBM115649(US8633183, D-24)
Affinity DataIC50:  9nM. Assay description: The mTOR kinase TR-FRET assay utilizes a physiologically relevant protein substrate for mTOR (4E-BP1, labeled with an acceptor fluorophore (Green Flu...
In DepthDetails US Patent