BDBM116130 US8633183, E-284
SMILES CCc1ncnc(-c2ccc(C(=O)N3CCN(CCN)CC3)c(Cl)c2)c1C#Cc1ccc(N)nc1
InChI Key InChIKey=VGLITSIUVRNCRO-UHFFFAOYSA-N
Data  2 IC50
  Tab Delimited (TSV)   2D SDfile   Computed 3D by Vconf -m prep SDfile
Find this compound or compounds like it in BindingDB:
Activity Spreadsheet -- Enzyme Inhibition Constant Data from BindingDB
Found 2 hits for monomerid = 116130
TargetSerine/threonine-protein kinase mTOR(Homo sapiens (Human))
Boehringer Ingelheim International
US Patent
LigandPNGBDBM116130(US8633183, E-284)
Affinity DataIC50:  8.45nM. Assay description: The mTOR kinase TR-FRET assay utilizes a physiologically relevant protein substrate for mTOR (4E-BP1, labeled with an acceptor fluorophore (Green Flu...
In DepthDetails US Patent
TargetPhosphatidylinositol 4,5-bisphosphate 3-kinase catalytic subunit alpha isoform(Homo sapiens (Human))
Boehringer Ingelheim International
US Patent
LigandPNGBDBM116130(US8633183, E-284)
Affinity DataIC50:  181nM. Assay description: PI3Kalpha assay described herein provides IC50 values indicating the activity of the compounds inhibiting PI3 kinase alpha activity Inhibition of PI3...
In DepthDetails US Patent