BDBM116203 US8637502, 20
SMILES Fc1cccc2N(C3CCN(CC3)C3CCCCCCC3)C(=O)CC(=O)Nc12
InChI Key InChIKey=OGIGRMUUQSTBDY-UHFFFAOYSA-N
Data  1 KI
  Tab Delimited (TSV)   2D SDfile   Computed 3D by Vconf -m prep SDfile
Find this compound or compounds like it in BindingDB:
Activity Spreadsheet -- Enzyme Inhibition Constant Data from BindingDB
Found 1 hit for monomerid = 116203
TargetNociceptin receptor(Homo sapiens (Human))
Purde Pharma
US Patent
LigandPNGBDBM116203(US8637502, 20)
Affinity DataKi:  229nM ΔG°:  -8.41kcal/molepH: 7.4 T: 2°C. Assay description: ORL-1 Receptor Binding Assay Procedures: Membranes from recombinant HEK-293 cells expressing the human opioid receptor-like receptor (ORL-1) (Recepto...
In DepthDetails US Patent