BDBM116256 US10035794, Example 33::US10683287, Example 33::US8637508, 33
SMILES Cc1cnc(cn1)C(=O)Nc1ccc(F)c(n1)[C@]1(C)CO[C@](C)(C(N)=N1)C(F)(F)F
InChI Key InChIKey=QEEWKGAHKUUMAX-DLBZAZTESA-N
Data  7 IC50
  Tab Delimited (TSV)   2D SDfile   Computed 3D by Vconf -m prep SDfile
Find this compound or compounds like it in BindingDB:
Activity Spreadsheet -- Enzyme Inhibition Constant Data from BindingDB
Found 7 hits for monomerid = 116256
TargetBeta-secretase 1(Homo sapiens (Human))
Novartis
US Patent
LigandPNGBDBM116256(US10035794, Example 33 | US10683287, Example 33 | ...)
Affinity DataIC50:  820nMpH: 4.5 T: 2°C. Assay description: Recombinant BACE-1 (extracellular domain, expressed in baculovirus and purified using standard methods) at 0.1 to 10 nM concentrations is incubated w...
In DepthDetails US Patent
TargetBeta-secretase 2(Homo sapiens (Human))
Novartis
US Patent
LigandPNGBDBM116256(US10035794, Example 33 | US10683287, Example 33 | ...)
Affinity DataIC50:  330nMpH: 4.5 T: 2°C. Assay description: Recombinant BACE-2 (extracellular domain, expressed in baculovirus and purified using standard methods) at 0.1 to 10 nM concentrations is incubated w...
In DepthDetails US Patent
TargetBeta-secretase 1(Homo sapiens (Human))
Novartis
US Patent
LigandPNGBDBM116256(US10035794, Example 33 | US10683287, Example 33 | ...)
Affinity DataIC50:  820nMpH: 4.5 T: 2°C. Assay description: Recombinant BACE-1 (extracellular domain, expressed in baculovirus and purified using standard methods) at 0.1 to 10 nM concentrations is incubated w...
In DepthDetails US Patent
TargetBeta-secretase 2(Homo sapiens (Human))
Novartis
US Patent
LigandPNGBDBM116256(US10035794, Example 33 | US10683287, Example 33 | ...)
Affinity DataIC50:  330nM. Assay description: Recombinant BACE-2 (extracellular domain, expressed in baculovirus and purified using standard methods) at 0.1 to 10 nM concentrations is incubated w...
In DepthDetails US Patent
TargetIsocitrate dehydrogenase [NADP] cytoplasmic [R132H](Homo sapiens (Human))
Novartis
US Patent
LigandPNGBDBM116256(US10035794, Example 33 | US10683287, Example 33 | ...)
Affinity DataIC50:  130nM. Assay description: Chinese hamster ovary cells are transfected with the human gene for amyloid precursor protein. The cells are plated at a density of 8000 cells/well i...
In DepthDetails US Patent
TargetBeta-secretase 1(Homo sapiens (Human))
Novartis
US Patent
LigandPNGBDBM116256(US10035794, Example 33 | US10683287, Example 33 | ...)
Affinity DataIC50:  820nM. Assay description: Recombinant BACE-1 (extracellular domain, expressed in baculovirus and purified using standard methods) at 0.1 to 10 nM concentrations is incubated w...
In DepthDetails US Patent
TargetBeta-secretase 2(Homo sapiens (Human))
Novartis
US Patent
LigandPNGBDBM116256(US10035794, Example 33 | US10683287, Example 33 | ...)
Affinity DataIC50:  330nMpH: 4.5 T: 2°C. Assay description: Recombinant BACE-2 (extracellular domain, expressed in baculovirus and purified using standard methods) at 0.1 to 10 nM concentrations is incubated w...
In DepthDetails US Patent