BDBM116339 US8637532, 20
SMILES NC(=O)c1cccc2c(NCc3cccc(Br)c3)ncnc12
InChI Key InChIKey=GHPPBFVKOZAUET-UHFFFAOYSA-N
Data  2 IC50
  Tab Delimited (TSV)   2D SDfile   Computed 3D by Vconf -m prep SDfile
Find this compound or compounds like it in BindingDB:
Activity Spreadsheet -- Enzyme Inhibition Constant Data from BindingDB
Found 2 hits for monomerid = 116339
TargetAurora kinase A(Homo sapiens (Human))
Merck Patent
US Patent
LigandPNGBDBM116339(US8637532, 20)
Affinity DataIC50:  190nM. Assay description: The Aurora assays described here are performed on two Caliper Life Sciences systems: the LC3000 and the Desktop Profiler. These provide data on enzym...
In DepthDetails US Patent
TargetRibosomal protein S6 kinase beta-1(Homo sapiens (Human))
Merck Patent
US Patent
LigandPNGBDBM116339(US8637532, 20)
Affinity DataIC50:  11.2nMpH: 7.5 T: 2°C. Assay description: P70S6K inhibitor compounds are diluted and plated in 96 well plates. A reaction mixture including the following components is then added to the compo...
In DepthDetails US Patent