BDBM116578 US8637532, 270
SMILES C[C@@H](Nc1ncnc2c(cccc12)C(N)=O)c1cccc(NC(=O)c2ccc3OCOc3c2)c1
InChI Key InChIKey=YNPQIFHMRSVLHW-CQSZACIVSA-N
Data  1 IC50
  Tab Delimited (TSV)   2D SDfile   Computed 3D by Vconf -m prep SDfile
Find this compound or compounds like it in BindingDB:
Activity Spreadsheet -- Enzyme Inhibition Constant Data from BindingDB
Found 1 hit for monomerid = 116578
TargetRibosomal protein S6 kinase beta-1(Homo sapiens (Human))
Merck Patent
US Patent
LigandPNGBDBM116578(US8637532, 270)
Affinity DataIC50:  6.5nMpH: 7.5 T: 2°C. Assay description: P70S6K inhibitor compounds are diluted and plated in 96 well plates. A reaction mixture including the following components is then added to the compo...
In DepthDetails US Patent