BDBM116631 US8637532, 330
SMILES COc1ccc(cc1)C(=O)Nc1cccc(c1)C(CCN(C)CC=C)Nc1ncnc2c(cccc12)C(N)=O
InChI Key InChIKey=NRBGHJOLFXFDFP-UHFFFAOYSA-N
Data  3 IC50
  Tab Delimited (TSV)   2D SDfile   Computed 3D by Vconf -m prep SDfile
Find this compound or compounds like it in BindingDB:
Activity Spreadsheet -- Enzyme Inhibition Constant Data from BindingDB
Found 3 hits for monomerid = 116631
TargetRibosomal protein S6 kinase beta-1(Homo sapiens (Human))
Merck Patent
US Patent
LigandPNGBDBM116631(US8637532, 330)
Affinity DataIC50:  16nMpH: 7.5 T: 2°C. Assay description: P70S6K inhibitor compounds are diluted and plated in 96 well plates. A reaction mixture including the following components is then added to the compo...
In DepthDetails US Patent
TargetAurora kinase B(Homo sapiens (Human))
Merck Patent
US Patent
LigandPNGBDBM116631(US8637532, 330)
Affinity DataIC50:  1.80nM. Assay description: The Aurora assays described here are performed on two Caliper Life Sciences systems: the LC3000 and the Desktop Profiler. These provide data on enzym...
In DepthDetails US Patent
TargetAurora kinase A(Homo sapiens (Human))
Merck Patent
US Patent
LigandPNGBDBM116631(US8637532, 330)
Affinity DataIC50:  0.160nM. Assay description: The Aurora assays described here are performed on two Caliper Life Sciences systems: the LC3000 and the Desktop Profiler. These provide data on enzym...
In DepthDetails US Patent