BDBM116671 US8637532, 373
SMILES COc1ccc(C(=O)Nc2cccc(c2)[C@@H](C)Nc2ncnc3c(cccc23)C(N)=O)c(Cl)n1
InChI Key InChIKey=JSUHYJIHHCDQHG-CYBMUJFWSA-N
Data  1 IC50
  Tab Delimited (TSV)   2D SDfile   Computed 3D by Vconf -m prep SDfile
Find this compound or compounds like it in BindingDB:
Activity Spreadsheet -- Enzyme Inhibition Constant Data from BindingDB
Found 1 hit for monomerid = 116671
TargetRibosomal protein S6 kinase beta-1(Homo sapiens (Human))
Merck Patent
US Patent
LigandPNGBDBM116671(US8637532, 373)
Affinity DataIC50:  23nMpH: 7.5 T: 2°C. Assay description: P70S6K inhibitor compounds are diluted and plated in 96 well plates. A reaction mixture including the following components is then added to the compo...
In DepthDetails US Patent