BDBM116919 US8637532, 646
SMILES CNc1cccc(c1)C(=O)Nc1cccc(CNc2ncnc3c(cccc23)C(N)=O)c1
InChI Key InChIKey=RYROLHUONOCJPP-UHFFFAOYSA-N
Data  2 IC50
  Tab Delimited (TSV)   2D SDfile   Computed 3D by Vconf -m prep SDfile
Find this compound or compounds like it in BindingDB:
Activity Spreadsheet -- Enzyme Inhibition Constant Data from BindingDB
Found 2 hits for monomerid = 116919
TargetAurora kinase B(Homo sapiens (Human))
Merck Patent
US Patent
LigandPNGBDBM116919(US8637532, 646)
Affinity DataIC50:  15nM. Assay description: The Aurora assays described here are performed on two Caliper Life Sciences systems: the LC3000 and the Desktop Profiler. These provide data on enzym...
In DepthDetails US Patent
TargetAurora kinase A(Homo sapiens (Human))
Merck Patent
US Patent
LigandPNGBDBM116919(US8637532, 646)
Affinity DataIC50:  10nM. Assay description: The Aurora assays described here are performed on two Caliper Life Sciences systems: the LC3000 and the Desktop Profiler. These provide data on enzym...
In DepthDetails US Patent