BDBM117104 US8648092, 34
SMILES ONC(=O)\C=C\c1ccn2cc(nc2c1)-c1ccccc1
InChI Key InChIKey=CBFMQPPUYIDAAF-VOTSOKGWSA-N
Data  1 IC50
  Tab Delimited (TSV)   2D SDfile   Computed 3D by Vconf -m prep SDfile
Find this compound or compounds like it in BindingDB:
Activity Spreadsheet -- Enzyme Inhibition Constant Data from BindingDB
Found 1 hit for monomerid = 117104
TargetHistone deacetylase 1(Homo sapiens (Human))
Mei Pharma
US Patent
LigandPNGBDBM117104(US8648092, 34)
Affinity DataIC50:  870nMpH: 7.5 T: 2°C. Assay description: The assay has been carried out in 96 well format and the BIOMOL fluorescent-based HDAC activity assay has been applied. The reaction composed of assa...
Ligand InfoPC cidPC sid
In DepthDetails US Patent