BDBM117827 US8653087, III-507
SMILES Cc1cn(cn1)-c1cc(NC(=O)c2ccc(C)c(Nc3ncnc4cnc(NC5CCOC5)nc34)c2)cc(c1)C(F)(F)F
InChI Key InChIKey=YXZOOHZBYSCFKD-UHFFFAOYSA-N
Data  1 IC50
  Tab Delimited (TSV)   2D SDfile   Computed 3D by Vconf -m prep SDfile
Find this compound or compounds like it in BindingDB:
Activity Spreadsheet -- Enzyme Inhibition Constant Data from BindingDB
Found 1 hit for monomerid = 117827
TargetSerine/threonine-protein kinase B-raf [V600E](Homo sapiens (Human))
Boehringer Ingelheim International
US Patent
LigandPNGBDBM117827(US8653087, III-507)
Affinity DataIC50:  1nMpH: 7.5Assay Description:The final concentration of DMSO is 5%. 10 μL of the B-Raf (V600E)-kinase solution are pipetted in (containing 0.5 ng B-Raf (V600E)-kinase in 20 ...
In DepthDetails US Patent