BDBM117925 US8653087, III-605
SMILES Cc1cn(cn1)-c1ncc2ncnc(Nc3cc(ccc3C)C(=O)Nc3cc(n[nH]3)C(C)(C)C)c2n1
InChI Key InChIKey=RPRJVCIVGSMXST-UHFFFAOYSA-N
Data  1 IC50
  Tab Delimited (TSV)   2D SDfile   Computed 3D by Vconf -m prep SDfile
Find this compound or compounds like it in BindingDB:
Activity Spreadsheet -- Enzyme Inhibition Constant Data from BindingDB
Found 1 hit for monomerid = 117925
TargetSerine/threonine-protein kinase B-raf [V600E](Homo sapiens (Human))
Boehringer Ingelheim International
US Patent
LigandPNGBDBM117925(US8653087, III-605)
Affinity DataIC50:  6nMpH: 7.5Assay Description:The final concentration of DMSO is 5%. 10 μL of the B-Raf (V600E)-kinase solution are pipetted in (containing 0.5 ng B-Raf (V600E)-kinase in 20 ...
In DepthDetails US Patent