BDBM119300 US8673906, 4.19::US9718800, 4.19
SMILES COCCCNC(=O)c1cc(C(C)Nc2cc(F)cc(F)c2)c2oc(cc(=O)c2c1)N1CCOCC1
InChI Key InChIKey=ODOGNFDAEDWNJW-UHFFFAOYSA-N
Data  2 IC50
  Tab Delimited (TSV)   2D SDfile   Computed 3D by Vconf -m prep SDfile
Find this compound or compounds like it in BindingDB:
Activity Spreadsheet -- Enzyme Inhibition Constant Data from BindingDB
Found 2 hits for monomerid = 119300
LigandPNGBDBM119300(US8673906, 4.19 | US9718800, 4.19)
Affinity DataIC50:  23nMT: 2°C. Assay description: Compounds in 100% DMSO were added to assay plates by acoustic dispensing. PI3Kβ was added in a Tris buffer (50 mM Tris pH7.4, 0.05% CHAPS, 2.1 m...
In DepthDetails US Patent
LigandPNGBDBM119300(US8673906, 4.19 | US9718800, 4.19)
Affinity DataIC50:  23nM. Assay description: The inhibition of PI3Kβ, PI3Kα, PI3Kγ and PI3Kδ was evaluated in a Kinase Glo based enzyme activity assay using human recombinant...
In DepthDetails US Patent