BDBM119342 US8673905, 55
SMILES CN1CCN(CC1)c1nccn2c(cnc12)-c1cccc(NC(CN)c2ccccc2)n1
InChI Key InChIKey=SSXBTTVHJLNKBB-UHFFFAOYSA-N
Data  1 IC50
  Tab Delimited (TSV)   2D SDfile   Computed 3D by Vconf -m prep SDfile
Find this compound or compounds like it in BindingDB:
Activity Spreadsheet -- Enzyme Inhibition Constant Data from BindingDB
Found 1 hit for monomerid = 119342
TargetReceptor-type tyrosine-protein kinase FLT3(Homo sapiens (Human))
Hoffmann-La Roche
US Patent
LigandPNGBDBM119342(US8673905, 55)
Affinity DataIC50:  540nMpH: 7.5 T: 2°C. Assay description: FLT3 kinase assay was obtained from Claiper Life Sciences (Catalog #200-0423). The assay was carried out with human recombinant FLT3 (0.287 nM), fluo...
In DepthDetails US Patent