BDBM119423 US8669266, 296
SMILES CCOC(=O)N1CCN(CC1)C(=O)[C@H](CCC(O)=O)NC(=O)c1cc(O[C@H](C)C(=O)N2CCC[C@H]2C(=O)N2CCCCC2)c2ccc(C)cc2n1
InChI Key InChIKey=MAHOFDIDXRFMIP-AZIXZEHSSA-N
Data  1 IC50
  Tab Delimited (TSV)   2D SDfile   Computed 3D by Vconf -m prep SDfile
Find this compound or compounds like it in BindingDB:
Activity Spreadsheet -- Enzyme Inhibition Constant Data from BindingDB
Found 1 hit for monomerid = 119423
TargetP2Y purinoceptor 12(Homo sapiens (Human))
Sanofi
US Patent
LigandPNGBDBM119423(US8669266, 296)
Affinity DataIC50:  12nM. Assay description: The ability of a test compound to bind to the P2Y12 receptor was evaluated in a recombinant cell membrane binding assay. In this competitive binding ...
In DepthDetails US Patent