BDBM119431 US8669266, 528
SMILES CCCCOC(=O)N1CCN(CC1)C(=O)[C@H](CO)NC(=O)c1cc(OCC(=O)N2CCC[C@H]2C(=O)NC2CCC2)c2ccc(C)cc2n1
InChI Key InChIKey=IEPRSILLVXTIIZ-NSOVKSMOSA-N
Data  1 IC50
  Tab Delimited (TSV)   2D SDfile   Computed 3D by Vconf -m prep SDfile
Find this compound or compounds like it in BindingDB:
Activity Spreadsheet -- Enzyme Inhibition Constant Data from BindingDB
Found 1 hit for monomerid = 119431
TargetP2Y purinoceptor 12(Homo sapiens (Human))
Sanofi
US Patent
LigandPNGBDBM119431(US8669266, 528)
Affinity DataIC50:  4nM. Assay description: The ability of a test compound to bind to the P2Y12 receptor was evaluated in a recombinant cell membrane binding assay. In this competitive binding ...
In DepthDetails US Patent