BDBM119465 US8680120, 25-13
SMILES COc1ccc2n(Cc3cccc(c3)C(O)=O)c(cc2c1)-c1cccnc1
InChI Key InChIKey=PMJOTJQSINNTQG-UHFFFAOYSA-N
Data  1 IC50
  Tab Delimited (TSV)   2D SDfile   Computed 3D by Vconf -m prep SDfile
Find this compound or compounds like it in BindingDB:
Activity Spreadsheet -- Enzyme Inhibition Constant Data from BindingDB
Found 1 hit for monomerid = 119465
TargetProstaglandin E2 receptor EP1 subtype(Rattus norvegicus (Rat))
Kissei Pharmaceutical
US Patent
LigandPNGBDBM119465(US8680120, 25-13)
Affinity DataIC50:  38nM. Assay description: The rat EP1 receptor-expressing cells were washed with the assay buffer. 100 μL of a fluorescent calcium indicator (Calcium kit II, Fluo 4 (Doji...
In DepthDetails US Patent