BDBM119481 US8680120, 25-41
SMILES COc1ccc2n(Cc3cccc(n3)C(O)=O)c(cc2c1)-c1cc(F)ccc1F
InChI Key InChIKey=JZSRAEAMSHQMLU-UHFFFAOYSA-N
Data  1 IC50
  Tab Delimited (TSV)   2D SDfile   Computed 3D by Vconf -m prep SDfile
Find this compound or compounds like it in BindingDB:
Activity Spreadsheet -- Enzyme Inhibition Constant Data from BindingDB
Found 1 hit for monomerid = 119481
TargetProstaglandin E2 receptor EP1 subtype(Rattus norvegicus (Rat))
Kissei Pharmaceutical
US Patent
LigandPNGBDBM119481(US8680120, 25-41)
Affinity DataIC50:  25nM. Assay description: The rat EP1 receptor-expressing cells were washed with the assay buffer. 100 μL of a fluorescent calcium indicator (Calcium kit II, Fluo 4 (Doji...
In DepthDetails US Patent