BDBM119607 US8680275, 164
SMILES Cc1cc(C)nc(n1)N1C[C@@H]2CCN(C[C@H]12)C(=O)c1cc(F)ccc1Br
InChI Key InChIKey=DICRKFALAXMPIZ-GUYCJALGSA-N
Data  2 KI
  Tab Delimited (TSV)   2D SDfile   Computed 3D by Vconf -m prep SDfile
Find this compound or compounds like it in BindingDB:
Activity Spreadsheet -- Enzyme Inhibition Constant Data from BindingDB
Found 2 hits for monomerid = 119607
TargetOrexin receptor type 2(Homo sapiens (Human))
Janssen Pharmaceutica
US Patent
LigandPNGBDBM119607(US8680275, 164)
Affinity DataKi:  190nM ΔG°:  -8.52kcal/moleT: 2°C. Assay description: HEK293 stably expressing human orexin-2 receptor (Genebank accession number NM 001526) were grown to confluency in DMEM/F12 (Gibco, Cat #11039), in D...
Ligand InfoPC cidPC sid
In DepthDetails US Patent
TargetOrexin/Hypocretin receptor type 1(Homo sapiens (Human))
Janssen Pharmaceutica
US Patent
LigandPNGBDBM119607(US8680275, 164)
Affinity DataKi:  3.90E+3nM ΔG°:  -6.85kcal/moleT: 2°C. Assay description: Chinese ovary cells (CHO) stably expressing human orexin 1 receptor (Genebank accession number NM 001526) were grown to confluency in DMEM/F12 (Gibco...
Ligand InfoPC cidPC sid
In DepthDetails US Patent