BDBM119778 CHEMBL2180429::US8691827, I-9
SMILES O=C(Nc1ccccc1)N1CCc2nc(nc(NCc3cnc([nH]3)-c3ccccc3)c2C1)-c1cccnc1
InChI Key InChIKey=SUXIEGABMZYCJH-UHFFFAOYSA-N
Data  2 KI
  Tab Delimited (TSV)   2D SDfile   Computed 3D by Vconf -m prep SDfile
Find this compound or compounds like it in BindingDB:
Activity Spreadsheet -- Enzyme Inhibition Constant Data from BindingDB
Found 2 hits for monomerid = 119778
TargetcAMP and cAMP-inhibited cGMP 3',5'-cyclic phosphodiesterase 10A(Homo sapiens (Human))
Merck Sharp & Dohme
US Patent
LigandPNGBDBM119778(CHEMBL2180429 | US8691827, I-9)
Affinity DataKi:  2.19nM. Assay description: The PDE10 Ki is a measure of the ability of the test compound to inhibit the action of the PDE10 enzyme. The final product may be further modified, ...
In DepthDetails US Patent
TargetcAMP and cAMP-inhibited cGMP 3',5'-cyclic phosphodiesterase 10A(Homo sapiens (Human))
Merck Sharp & Dohme
US Patent
LigandPNGBDBM119778(CHEMBL2180429 | US8691827, I-9)
Affinity DataKi:  2.20nM. Assay description: Inhibition of PDE10A by fluorescence polarization assay
In DepthDetails ArticlePubMed