BDBM120333 US8703811, 75
SMILES CCNC(=O)c1ccc(s1)-n1cc(nc1C)-c1ccccc1
InChI Key InChIKey=DIWXLJKBMRSXIC-UHFFFAOYSA-N
Data  1 IC50
  Tab Delimited (TSV)   2D SDfile   Computed 3D by Vconf -m prep SDfile
Find this compound or compounds like it in BindingDB:
Activity Spreadsheet -- Enzyme Inhibition Constant Data from BindingDB
Found 1 hit for monomerid = 120333
TargetDihydroorotate dehydrogenase (quinone), mitochondrial(Plasmodium falciparum)
Genzyme
US Patent
LigandPNGBDBM120333(US8703811, 75)
Affinity DataIC50:  416nM. Assay description: Type 2 DHODH activity was monitored with either the direct assay measuring the formation of orotate or via a chromogen reduction assay using DCIP. Al...
In DepthDetails US Patent