BDBM120368 US8703807, 4
SMILES CC(C)Oc1ccc(cc1)N1CC[C@]2(CC[C@@](O)(CN3CCCCC3=O)CC2)C1=O
InChI Key InChIKey=MZTCLPDWZWEGMR-PSWAGMNNSA-N
Data  1 IC50
  Tab Delimited (TSV)   2D SDfile   Computed 3D by Vconf -m prep SDfile
Find this compound or compounds like it in BindingDB:
Activity Spreadsheet -- Enzyme Inhibition Constant Data from BindingDB
Found 1 hit for monomerid = 120368
TargetHormone-sensitive lipase(Homo sapiens (Human))
Hoffmann-La Roche
US Patent
LigandPNGBDBM120368(US8703807, 4)
Affinity DataIC50:  27.4nMpH: 7.2 T: 2°C. Assay description: HSL enzyme activity was measured by a colorimetric assay using 2,3-dimercapto-1-propanol tributyrate (Aldrich, St. Louis, Mo.) as a substrate. Typica...
In DepthDetails US Patent