BDBM12084 3-Amino-1,4,5,6-tetrahydropyrrolo[3,4-c]pyrazole 2::N-{5-acetyl-1H,4H,5H,6H-pyrrolo[3,4-c]pyrazol-3-yl}-4-methylbenzamide
SMILES CC(=O)N1Cc2n[nH]c(NC(=O)c3ccc(C)cc3)c2C1
InChI Key InChIKey=AUBRDCSUKBUOFM-UHFFFAOYSA-N
Data  2 IC50
  Tab Delimited (TSV)   2D SDfile   Computed 3D by Vconf -m prep SDfile
Find this compound or compounds like it in BindingDB:
Activity Spreadsheet -- Enzyme Inhibition Constant Data from BindingDB
Found 2 hits for monomerid = 12084
TargetAurora kinase A(Homo sapiens (Human))
Nerviano Medical Sciences
LigandPNGBDBM12084(3-Amino-1,4,5,6-tetrahydropyrrolo[3,4-c]pyrazole 2...)
Affinity DataIC50:  2.14E+3nM. Assay description: The biochemical activity of compounds was determined by incubation with specific enzymes and substrates in the presence ATP/[gamma-33P] ATP. After in...
In DepthDetails ArticlePubMed
TargetCyclin-A2/Cyclin-dependent kinase 2(Homo sapiens (Human))
Nerviano Medical Sciences
LigandPNGBDBM12084(3-Amino-1,4,5,6-tetrahydropyrrolo[3,4-c]pyrazole 2...)
Affinity DataIC50:  1.08E+3nMpH: 7.4 T: 2°C. Assay description: The biochemical activity of compounds was determined by incubation with specific enzymes and substrates in the presence ATP/[gamma-33P] ATP. After in...
In DepthDetails ArticlePubMed