BDBM12087 3-Amino-1,4,5,6-tetrahydropyrrolo[3,4-c]pyrazole 5::4-cyano-N-{5-acetyl-1H,4H,5H,6H-pyrrolo[3,4-c]pyrazol-3-yl}benzamide
SMILES CC(=O)N1Cc2n[nH]c(NC(=O)c3ccc(cc3)C#N)c2C1
InChI Key InChIKey=INFKSNNETMNNPG-UHFFFAOYSA-N
Data  2 IC50
  Tab Delimited (TSV)   2D SDfile   Computed 3D by Vconf -m prep SDfile
Find this compound or compounds like it in BindingDB:
Activity Spreadsheet -- Enzyme Inhibition Constant Data from BindingDB
Found 2 hits for monomerid = 12087
TargetAurora kinase A(Homo sapiens (Human))
Nerviano Medical Sciences
LigandPNGBDBM12087(3-Amino-1,4,5,6-tetrahydropyrrolo[3,4-c]pyrazole 5...)
Affinity DataIC50:  8.50E+3nM. Assay description: The biochemical activity of compounds was determined by incubation with specific enzymes and substrates in the presence ATP/[gamma-33P] ATP. After in...
In DepthDetails ArticlePubMed
TargetCyclin-A2/Cyclin-dependent kinase 2(Homo sapiens (Human))
Nerviano Medical Sciences
LigandPNGBDBM12087(3-Amino-1,4,5,6-tetrahydropyrrolo[3,4-c]pyrazole 5...)
Affinity DataIC50:  1.59E+3nMpH: 7.4 T: 2°C. Assay description: The biochemical activity of compounds was determined by incubation with specific enzymes and substrates in the presence ATP/[gamma-33P] ATP. After in...
In DepthDetails ArticlePubMed