BDBM121094 US8722896, (-)-(3R)-1-(4-aminobenzyl)-N- (9-chloro-3,4-dihydro-2H-1,5- benzodioxepin-7-ylmethyl)-N- isobutylpyrrolidine-3- carboxamide
SMILES CC(C)CN(Cc1cc(Cl)c2OCCCOc2c1)C(=O)[C@@H]1CCN(Cc2ccc(N)cc2)C1
InChI Key InChIKey=SNMIPBINTIEKJS-OAQYLSRUSA-N
Data  1 KI
  Tab Delimited (TSV)   2D SDfile   Computed 3D by Vconf -m prep SDfile
Find this compound or compounds like it in BindingDB:
Activity Spreadsheet -- Enzyme Inhibition Constant Data from BindingDB
Found 1 hit for monomerid = 121094
TargetProkineticin receptor 2(Cricetulus griseus (Chinese hamster))
The Regents Of The University Of California
US Patent
LigandPNGBDBM121094(US8722896, (-)-(3R)-1-(4-aminobenzyl)-N- (9-chloro...)
Affinity DataKi:  52.8nM ΔG°:  -10.3kcal/moleT: 2°C. Assay description: An aequorin-based luminescent assay for calcium mobilization was used to measure mobilization of intracellular Ca2+ (Bullock et al., Mol Pharmacol 65...
In DepthDetails US Patent