BDBM121104 US8722896, (-)-(3R)-1-(Indol-4-ylmethyl)-N- (9-chloro-3,4-dihydro-2H-1,5- benzodioxepin-7-ylmethyl)-N- isobutylpyrrolidine-3- carboxamide
SMILES CC(C)CN(Cc1cc(Cl)c2OCCCOc2c1)C(=O)[C@@H]1CCN(Cc2cccc3[nH]ccc23)C1
InChI Key InChIKey=KNAYMZFMSMWIMV-JOCHJYFZSA-N
Data  2 KI
  Tab Delimited (TSV)   2D SDfile   Computed 3D by Vconf -m prep SDfile
Find this compound or compounds like it in BindingDB:
Activity Spreadsheet -- Enzyme Inhibition Constant Data from BindingDB
Found 2 hits for monomerid = 121104
TargetProkineticin receptor 2(Cricetulus griseus (Chinese hamster))
The Regents Of The University Of California
US Patent
LigandPNGBDBM121104(US8722896, (-)-(3R)-1-(Indol-4-ylmethyl)-N- (9-chl...)
Affinity DataKi:  2.5nM ΔG°:  -12.2kcal/moleT: 2°C. Assay description: An aequorin-based luminescent assay for calcium mobilization was used to measure mobilization of intracellular Ca2+ (Bullock et al., Mol Pharmacol 65...
In DepthDetails US Patent
TargetProkineticin receptor 1(Cricetulus griseus (Chinese hamster))
The Regents Of The University Of California
US Patent
LigandPNGBDBM121104(US8722896, (-)-(3R)-1-(Indol-4-ylmethyl)-N- (9-chl...)
Affinity DataKi:  32nM ΔG°:  -10.6kcal/moleT: 2°C. Assay description: An aequorin-based luminescent assay for calcium mobilization was used to measure mobilization of intracellular Ca2+ (Bullock et al., Mol Pharmacol 65...
In DepthDetails US Patent