BDBM121125 US8722896, (+/-)-1-Benzyl-N-(6-chloro-3,4- dihydro-2H-1,5-benzodioxepin- 7-ylmethyl)-N- isobutylpyrrolidine-3- carboxamide
SMILES CC(C)CN(Cc1ccc2OCCCOc2c1Cl)C(=O)C1CCN(Cc2ccccc2)C1
InChI Key InChIKey=LJGOZKOFSMLCLB-UHFFFAOYSA-N
Data  1 KI
  Tab Delimited (TSV)   2D SDfile   Computed 3D by Vconf -m prep SDfile
Find this compound or compounds like it in BindingDB:
Activity Spreadsheet -- Enzyme Inhibition Constant Data from BindingDB
Found 1 hit for monomerid = 121125
TargetProkineticin receptor 2(Cricetulus griseus (Chinese hamster))
The Regents Of The University Of California
US Patent
LigandPNGBDBM121125(US8722896, (+/-)-1-Benzyl-N-(6-chloro-3,4- dihydro...)
Affinity DataKi:  1.88E+3nM ΔG°:  -8.12kcal/moleT: 2°C. Assay description: An aequorin-based luminescent assay for calcium mobilization was used to measure mobilization of intracellular Ca2+ (Bullock et al., Mol Pharmacol 65...
In DepthDetails US Patent