BDBM121281 US8722896, (+/-)-4-(2,3-Dihydro-1- benzofuran-7-ylmethyl)-N-(9- chloro-3,4-dihydro-2H-1,5- benzodioxepin-7-ylmethyl)-N- isobutylmorpholine-2- carboxamide
SMILES CC(C)CN(Cc1cc(Cl)c2OCCCOc2c1)C(=O)C1CN(Cc2cccc3CCOc23)CCO1
InChI Key InChIKey=VJMDABLSVHGUQL-UHFFFAOYSA-N
Data  2 KI
  Tab Delimited (TSV)   2D SDfile   Computed 3D by Vconf -m prep SDfile
Find this compound or compounds like it in BindingDB:
Activity Spreadsheet -- Enzyme Inhibition Constant Data from BindingDB
Found 2 hits for monomerid = 121281
TargetProkineticin receptor 2(Cricetulus griseus (Chinese hamster))
The Regents Of The University Of California
US Patent
LigandPNGBDBM121281(US8722896, (+/-)-4-(2,3-Dihydro-1- benzofuran-7-yl...)
Affinity DataKi:  3.10nM ΔG°:  -12.1kcal/moleT: 2°C. Assay description: An aequorin-based luminescent assay for calcium mobilization was used to measure mobilization of intracellular Ca2+ (Bullock et al., Mol Pharmacol 65...
In DepthDetails US Patent
TargetProkineticin receptor 1(Cricetulus griseus (Chinese hamster))
The Regents Of The University Of California
US Patent
LigandPNGBDBM121281(US8722896, (+/-)-4-(2,3-Dihydro-1- benzofuran-7-yl...)
Affinity DataKi:  5.46nM ΔG°:  -11.7kcal/moleT: 2°C. Assay description: An aequorin-based luminescent assay for calcium mobilization was used to measure mobilization of intracellular Ca2+ (Bullock et al., Mol Pharmacol 65...
In DepthDetails US Patent