BDBM121440 US8722709, 44
SMILES NC(=O)Nc1cc(CCc2ccccc2C(F)(F)F)ccn1
InChI Key InChIKey=FJYVFPUQYHIRKW-UHFFFAOYSA-N
Data  1 IC50
  Tab Delimited (TSV)   2D SDfile   Computed 3D by Vconf -m prep SDfile
Find this compound or compounds like it in BindingDB:
Activity Spreadsheet -- Enzyme Inhibition Constant Data from BindingDB
Found 1 hit for monomerid = 121440
TargetMineralocorticoid receptor(Homo sapiens (Human))
Boehringer Ingelheim International
US Patent
LigandPNGBDBM121440(US8722709, 44)
Affinity DataIC50:  13nMpH: 7.4Assay Description:The MR competitive binding assay is based on the binding and displacement of a TAMRA-labeled Dexamethasone probe with fluorescence polarization (FP) ...
In DepthDetails US Patent