BDBM121448 US8722709, 52
SMILES NC(=O)Nc1cc(ccn1)-c1nc[nH]c1-c1ccc(F)cc1
InChI Key InChIKey=CYYTVUKCHKHPDX-UHFFFAOYSA-N
Data  1 IC50
  Tab Delimited (TSV)   2D SDfile   Computed 3D by Vconf -m prep SDfile
Find this compound or compounds like it in BindingDB:
Activity Spreadsheet -- Enzyme Inhibition Constant Data from BindingDB
Found 1 hit for monomerid = 121448
TargetMineralocorticoid receptor(Homo sapiens (Human))
Boehringer Ingelheim International
US Patent
LigandPNGBDBM121448(US8722709, 52)
Affinity DataIC50:  850nMpH: 7.4Assay Description:The MR competitive binding assay is based on the binding and displacement of a TAMRA-labeled Dexamethasone probe with fluorescence polarization (FP) ...
In DepthDetails US Patent