BDBM121461 US8722683, 8
SMILES O=C(CC1CC1)N[C@H]1CC[C@H](CCN2CCN(CC2)c2cccc3OCOc23)CC1
InChI Key InChIKey=UDDOLORLTBTWLQ-KESTWPANSA-N
Data  3 KI
  Tab Delimited (TSV)   2D SDfile   Computed 3D by Vconf -m prep SDfile
Find this compound or compounds like it in BindingDB:
Activity Spreadsheet -- Enzyme Inhibition Constant Data from BindingDB
Found 3 hits for monomerid = 121461
TargetD(3) dopamine receptor(Homo sapiens (Human))
Hoffmann-La Roche
US Patent
LigandPNGBDBM121461(US8722683, 8)
Affinity DataKi:  1.23nM. Assay description: Aliquots of membrane preparations were thawed at RT, resupended in assay buffer (D2, D3: 50 mM Tris-HCl, 120 mM NaCl, 5 mM MgCl2, 1 mM EDTA, 5 mM KCl...
In DepthDetails US Patent
Target5-hydroxytryptamine receptor 2A(Homo sapiens (Human))
Hoffmann-La Roche
US Patent
LigandPNGBDBM121461(US8722683, 8)
Affinity DataKi:  12.4nM. Assay description: Aliquots of membrane preparations were thawed at RT, resupended in assay buffer (D2, D3: 50 mM Tris-HCl, 120 mM NaCl, 5 mM MgCl2, 1 mM EDTA, 5 mM KCl...
In DepthDetails US Patent
TargetD(2) dopamine receptor(Homo sapiens (Human))
Hoffmann-La Roche
US Patent
LigandPNGBDBM121461(US8722683, 8)
Affinity DataKi:  142nM. Assay description: Aliquots of membrane preparations were thawed at RT, resupended in assay buffer (D2, D3: 50 mM Tris-HCl, 120 mM NaCl, 5 mM MgCl2, 1 mM EDTA, 5 mM KCl...
In DepthDetails US Patent