BDBM12153 2-(hydrazinecarbonyl)benzene-1-sulfonamide::hydrazide deriv. 6
SMILES NNC(=O)c1ccccc1S(N)(=O)=O
InChI Key InChIKey=YWPOXIABDFDDSR-UHFFFAOYSA-N
Data  3 KI
  Tab Delimited (TSV)   2D SDfile   Computed 3D by Vconf -m prep SDfile
Find this compound or compounds like it in BindingDB:
Activity Spreadsheet -- Enzyme Inhibition Constant Data from BindingDB
Found 3 hits for monomerid = 12153
TargetCarbonic anhydrase 2(Homo sapiens (Human))
Universita Degli Studi Di Firenze
LigandPNGBDBM12153(2-(hydrazinecarbonyl)benzene-1-sulfonamide | hydra...)
Affinity DataKi:  338nM. Assay description: An Applied Photophysics stopped-flow instrument has been used for assaying the CA-catalyzed CO2 hydration activity. Phenol red has been used as indic...
In DepthDetails ArticlePubMed
TargetCarbonic anhydrase 9(Homo sapiens (Human))
Universita Degli Studi Di Firenze
LigandPNGBDBM12153(2-(hydrazinecarbonyl)benzene-1-sulfonamide | hydra...)
Affinity DataKi:  547nM. Assay description: An Applied Photophysics stopped-flow instrument has been used for assaying the CA-catalyzed CO2 hydration activity. Phenol red has been used as indic...
In DepthDetails ArticlePubMed
TargetCarbonic anhydrase 1(Homo sapiens (Human))
Universita Degli Studi Di Firenze
LigandPNGBDBM12153(2-(hydrazinecarbonyl)benzene-1-sulfonamide | hydra...)
Affinity DataKi:  2.45E+4nM. Assay description: An Applied Photophysics stopped-flow instrument has been used for assaying the CA-catalyzed CO2 hydration activity. Phenol red has been used as indic...
In DepthDetails ArticlePubMed