BDBM121533 US8729273, 3
SMILES OC(=O)c1cnn(c1)-c1ccc2n(cc(C#N)c2c1)C1CC1
InChI Key InChIKey=ABWHPGGLUKLHSP-UHFFFAOYSA-N
Data  1 IC50
  Tab Delimited (TSV)   2D SDfile   Computed 3D by Vconf -m prep SDfile
Find this compound or compounds like it in BindingDB:
Activity Spreadsheet -- Enzyme Inhibition Constant Data from BindingDB
Found 1 hit for monomerid = 121533
TargetXanthine dehydrogenase/oxidase(Bos taurus (Bovine))
Lg Life Sciences
US Patent
LigandPNGBDBM121533(US8729273, 3)
Affinity DataIC50:  6nM. Assay description: Xanthine oxidase originated from bovine milk was incubated for 3 min with test compounds, and the initial velocity of uric acid formation was determi...
In DepthDetails US Patent