BDBM121681 US8722692, 120::US8722692, 124
SMILES CCNc1nc(cc2ncn(C)c(=O)c12)-c1ccc(cc1)S(=O)(=O)CCN1CCCC1
InChI Key InChIKey=IOLOITXUEZRKIL-UHFFFAOYSA-N
Data  2 IC50
  Tab Delimited (TSV)   2D SDfile   Computed 3D by Vconf -m prep SDfile
Find this compound or compounds like it in BindingDB:
Activity Spreadsheet -- Enzyme Inhibition Constant Data from BindingDB
Found 2 hits for monomerid = 121681
TargetTyrosine-protein kinase SYK(Homo sapiens (Human))
TBA
US Patent
LigandPNGBDBM121681(US8722692, 120 | US8722692, 124)
Affinity DataIC50:  222nM. Assay description: Compounds of the examples provided herein were assessed for their ability to inhibit Syk kinase by utilizing Caliper Life Sciences' proprietary L...
In DepthDetails US Patent
TargetTyrosine-protein kinase SYK(Homo sapiens (Human))
TBA
US Patent
LigandPNGBDBM121681(US8722692, 120 | US8722692, 124)
Affinity DataIC50:  222nM. Assay description: Compounds of the examples provided herein were assessed for their ability to inhibit Syk kinase by utilizing Caliper Life Sciences' proprietary L...
In DepthDetails US Patent