BDBM121712 US8722692, 151
SMILES Cn1cnc2cc(nc(OCc3cccnc3)c2c1=O)-c1ccc(nc1)C(C)(C)O
InChI Key InChIKey=MWOYSMHJLAODPE-UHFFFAOYSA-N
Data  1 IC50
  Tab Delimited (TSV)   2D SDfile   Computed 3D by Vconf -m prep SDfile
Find this compound or compounds like it in BindingDB:
Activity Spreadsheet -- Enzyme Inhibition Constant Data from BindingDB
Found 1 hit for monomerid = 121712
TargetTyrosine-protein kinase SYK(Homo sapiens (Human))
TBA
US Patent
LigandPNGBDBM121712(US8722692, 151)
Affinity DataIC50:  700nM. Assay description: Compounds of the examples provided herein were assessed for their ability to inhibit Syk kinase by utilizing Caliper Life Sciences' proprietary L...
In DepthDetails US Patent