BDBM12205 4-{[(2R,3S)-2-hydroxy-3-[(2S)-3-methyl-2-{3-[(2-methyl-1,3-thiazol-4-yl)methyl]-2-oxoimidazolidin-1-yl}butanamido]-4-phenylbutyl](2-methylpropyl)sulfamoyl}benzamide::benzenesulfonamide analog 15
SMILES CC(C)CN(C[C@@H](O)[C@H](Cc1ccccc1)NC(=O)[C@H](C(C)C)N1CCN(Cc2csc(C)n2)C1=O)S(=O)(=O)c1ccc(cc1)C(N)=O
InChI Key InChIKey=HAAWHYFIWOKEAU-YPKYBTACSA-N
Data  1 IC50
  Tab Delimited (TSV)   2D SDfile   Computed 3D by Vconf -m prep SDfile
Find this compound or compounds like it in BindingDB:
Activity Spreadsheet -- Enzyme Inhibition Constant Data from BindingDB
Found 1 hit for monomerid = 12205
TargetDimer of Gag-Pol polyprotein [489-587](Human immunodeficiency virus type 1)
Abbott Laboratories
LigandPNGBDBM12205(4-{[(2R,3S)-2-hydroxy-3-[(2S)-3-methyl-2-{3-[(2-me...)
Affinity DataIC50:  254nMpH: 4.5 T: 2°C. Assay description: HIV-1 protease inhibition was measured by a fluorescence assay using recombinant HIV-1 protease. The reactions were initiated by the addition of 1 nM...
In DepthDetails ArticlePubMed