BDBM122085 US8722692, 524
SMILES CN1CCN(CC1)c1ccc(cc1)-c1cc2ncn(C)c(=O)c2c(n1)N1CC2(COC2)C1
InChI Key InChIKey=HEQDIVQFGHYUOV-UHFFFAOYSA-N
Data  1 IC50
  Tab Delimited (TSV)   2D SDfile   Computed 3D by Vconf -m prep SDfile
Find this compound or compounds like it in BindingDB:
Activity Spreadsheet -- Enzyme Inhibition Constant Data from BindingDB
Found 1 hit for monomerid = 122085
TargetTyrosine-protein kinase SYK(Homo sapiens (Human))
TBA
US Patent
LigandPNGBDBM122085(US8722692, 524)
Affinity DataIC50:  1.01E+3nM. Assay description: Compounds of the examples provided herein were assessed for their ability to inhibit Syk kinase by utilizing Caliper Life Sciences' proprietary L...
In DepthDetails US Patent