BDBM122224 US8722692, 664
SMILES CN1C(=O)CS(=O)(=O)c2cc(ccc12)-c1cc2ncn(C)c(=O)c2c(N[C@@H]2CCOC2)n1
InChI Key InChIKey=GNFBQHGIZUNNJG-CYBMUJFWSA-N
Data  1 IC50
  Tab Delimited (TSV)   2D SDfile   Computed 3D by Vconf -m prep SDfile
Find this compound or compounds like it in BindingDB:
Activity Spreadsheet -- Enzyme Inhibition Constant Data from BindingDB
Found 1 hit for monomerid = 122224
TargetTyrosine-protein kinase SYK(Homo sapiens (Human))
TBA
US Patent
LigandPNGBDBM122224(US8722692, 664)
Affinity DataIC50:  243nM. Assay description: Compounds of the examples provided herein were assessed for their ability to inhibit Syk kinase by utilizing Caliper Life Sciences' proprietary L...
In DepthDetails US Patent