BDBM122470 US8729074, 24
SMILES Fc1ccc(cc1)S(=O)(=O)Nc1cc(cnc1Cl)-c1cnc2ncccn12
InChI Key InChIKey=CPPMNFNTYSLKBC-UHFFFAOYSA-N
Data  1 KI  2 IC50
  Tab Delimited (TSV)   2D SDfile   Computed 3D by Vconf -m prep SDfile
Find this compound or compounds like it in BindingDB:
Activity Spreadsheet -- Enzyme Inhibition Constant Data from BindingDB
Found 2 hits for monomerid = 122470
LigandPNGBDBM122470(US8729074, 24)
Affinity DataKi:  378nM IC50:  781nM. Assay description: The PI3K AlphaScreen assay (PerkinElmer, Waltham, Mass.) measures the activity of a panel of four phosphoinositide 3-kinases: PI3Kα, PI3Kβ,...
In DepthDetails US Patent
TargetSerine/threonine-protein kinase mTOR(Homo sapiens (Human))
Amgen
US Patent
LigandPNGBDBM122470(US8729074, 24)
Affinity DataIC50: >5.00E+4nM. Assay description: The Invitrogen (Carlsbad, Calif.) mammalian target of rapamycin (mTOR) Lanthascreen assay can be used to quantitate mTOR kinase activity in an in vit...
In DepthDetails US Patent