BDBM122956 US8735386, IV-9
SMILES CCN1CCN(CC1)c1ccc(Nc2ncc3CCc4nn(C)c(Cc5cccc(Cl)c5)c4-c3n2)c(OC)c1
InChI Key InChIKey=DYBQWTPWJPAYIN-UHFFFAOYSA-N
Data  1 IC50
  Tab Delimited (TSV)   2D SDfile   Computed 3D by Vconf -m prep SDfile
Find this compound or compounds like it in BindingDB:
Activity Spreadsheet -- Enzyme Inhibition Constant Data from BindingDB
Found 1 hit for monomerid = 122956
TargetInsulin-like growth factor 1 receptor(Homo sapiens (Human))
Boehringer Ingelheim International
US Patent
LigandPNGBDBM122956(US8735386, IV-9)
Affinity DataIC50:  1nMpH: 7.4Assay Description:The kinase activity is measured by DELFIA assay (dissociation-enhanced lanthanide fluorescence immunoassay, Perkin Elmer). The cytoplasmic kinase dom...
In DepthDetails US Patent