BDBM123110 (R)-2-(4-(5-tert-butyl-1-methyl-1H-pyrazol-3-ylamino)-1H-pyrazolo[3,4-d]pyrimidin-6-ylamino)-3-methylbutan-1-ol (9)
SMILES CC(C)[C@H](CO)Nc1nc(Nc2cc(n(C)n2)C(C)(C)C)c2c[nH]nc2n1
InChI Key InChIKey=RNQDYIXBGRKWPC-LBPRGKRZSA-N
Data  2 IC50
  Tab Delimited (TSV)   2D SDfile   Computed 3D by Vconf -m prep SDfile
Find this compound or compounds like it in BindingDB:
Activity Spreadsheet -- Enzyme Inhibition Constant Data from BindingDB
Found 2 hits for monomerid = 123110
TargetUDP-N-acetylmuramate--L-alanine ligase(Escherichia coli)
Astrazeneca India
LigandPNGBDBM123110((R)-2-(4-(5-tert-butyl-1-methyl-1H-pyrazol-3-ylami...)
Affinity DataIC50:  188nMT: 2°C. Assay description: The reactions (25 μL) were carried out in 25 mM Tris-HCl pH 8.0, 10 mM ammonium sulfate, 1.25 mM DTT, 0.002% Brij-35, 10 mM MgCl2, 40 μM UN...
In DepthDetails ArticlePubMed
TargetUDP-N-acetylmuramate--L-alanine ligase(Pseudomonas aeruginosa (G-proteobacteria))
Astrazeneca India
LigandPNGBDBM123110((R)-2-(4-(5-tert-butyl-1-methyl-1H-pyrazol-3-ylami...)
Affinity DataIC50:  13nMT: 2°C. Assay description: The reactions (50 μL) were carried out in 50 mM Tris-HCl pH 8.0, 20 mM ammonium sulfate, 2.5 mM DTT, 0.002% Brij-35, 1 mM MgCl2, 18 μM UNAM...
In DepthDetails ArticlePubMed