BDBM123200 US8742110, 2-2
SMILES Cn1cc(c(CN2CCC3(CN(C(=O)O3)c3ccc(cc3)C(O)=O)CC2)n1)-c1cc(F)c(F)cc1F
InChI Key InChIKey=BOHNIEGFMDHLHR-UHFFFAOYSA-N
Data  1 IC50
  Tab Delimited (TSV)   2D SDfile   Computed 3D by Vconf -m prep SDfile
Find this compound or compounds like it in BindingDB:
Activity Spreadsheet -- Enzyme Inhibition Constant Data from BindingDB
Found 1 hit for monomerid = 123200
TargetSomatostatin receptor type 5(Homo sapiens (Human))
Merck Sharp & Dohme
US Patent
LigandPNGBDBM123200(US8742110, 2-2)
Affinity DataIC50:  4.32E+3nMpH: 7.8Assay Description:SSTR5 binding assays can be performed by labeling somatostatin and determining the ability of a compound to inhibit somatostatin binding. (Poitout et...
In DepthDetails US Patent