BDBM123239 US8742110, 4-3
SMILES CCOc1ccc(c(CN2CCC3(CN(C(=O)O3)c3ccc(cc3)C(O)=O)CC2)c1)-c1ccc(F)cc1F
InChI Key InChIKey=VSXCYVYLRZSJRO-UHFFFAOYSA-N
Data  1 IC50
  Tab Delimited (TSV)   2D SDfile   Computed 3D by Vconf -m prep SDfile
Find this compound or compounds like it in BindingDB:
Activity Spreadsheet -- Enzyme Inhibition Constant Data from BindingDB
Found 1 hit for monomerid = 123239
TargetSomatostatin receptor type 5(Homo sapiens (Human))
Merck Sharp & Dohme
US Patent
LigandPNGBDBM123239(US8742110, 4-3)
Affinity DataIC50:  0.490nMpH: 7.8Assay Description:SSTR5 binding assays can be performed by labeling somatostatin and determining the ability of a compound to inhibit somatostatin binding. (Poitout et...
In DepthDetails US Patent