BDBM123270 US8742110, 5-6
SMILES COc1cccc2c(OC)cc(CN3CCC4(CN(C(=O)O4)c4ccc(cc4)C(O)=O)CC3)cc12
InChI Key InChIKey=QQGQLIQAHMGQDJ-UHFFFAOYSA-N
Data  1 IC50
  Tab Delimited (TSV)   2D SDfile   Computed 3D by Vconf -m prep SDfile
Find this compound or compounds like it in BindingDB:
Activity Spreadsheet -- Enzyme Inhibition Constant Data from BindingDB
Found 1 hit for monomerid = 123270
TargetSomatostatin receptor type 5(Homo sapiens (Human))
Merck Sharp & Dohme
US Patent
LigandPNGBDBM123270(US8742110, 5-6)
Affinity DataIC50:  0.172nMpH: 7.8Assay Description:SSTR5 binding assays can be performed by labeling somatostatin and determining the ability of a compound to inhibit somatostatin binding. (Poitout et...
In DepthDetails US Patent