BDBM123311 US8742110, 6-29
SMILES COc1ccc(cc1)-c1nc(sc1CN1CCC2(CN(C(=O)O2)c2ccc(cc2)C(O)=O)CC1)C(C)(C)C
InChI Key InChIKey=AFMMHESANIDPPI-UHFFFAOYSA-N
Data  1 IC50
  Tab Delimited (TSV)   2D SDfile   Computed 3D by Vconf -m prep SDfile
Find this compound or compounds like it in BindingDB:
Activity Spreadsheet -- Enzyme Inhibition Constant Data from BindingDB
Found 1 hit for monomerid = 123311
TargetSomatostatin receptor type 5(Homo sapiens (Human))
Merck Sharp & Dohme
US Patent
LigandPNGBDBM123311(US8742110, 6-29)
Affinity DataIC50:  0.705nMpH: 7.8Assay Description:SSTR5 binding assays can be performed by labeling somatostatin and determining the ability of a compound to inhibit somatostatin binding. (Poitout et...
In DepthDetails US Patent