BDBM123493 US8748435, 18
SMILES CCc1nn2c(C)cc(C)nc2c1Cc1ccc(\C=C\C(=O)N2CCN(C)CC2)cc1
InChI Key InChIKey=LESNPAAGHHFDTM-ZHACJKMWSA-N
Data  1 IC50
  Tab Delimited (TSV)   2D SDfile   Computed 3D by Vconf -m prep SDfile
Find this compound or compounds like it in BindingDB:
Activity Spreadsheet -- Enzyme Inhibition Constant Data from BindingDB
Found 1 hit for monomerid = 123493
TargetG-protein coupled receptor 4(Homo sapiens (Human))
Novartis
US Patent
LigandPNGBDBM123493(US8748435, 18)
Affinity DataIC50:  81nMpH: 8.0Assay Description:Serial dilutions of compounds (stock in 10 mM DMSO) are prepared by first diluting the compounds in DMSO followed by a 1:50 dilution into assay buffe...
In DepthDetails US Patent