BDBM123579 US8748624, 71
SMILES OC(=O)CCNC(=O)c1ccc(cn1)-c1cc(cc(c1CNc1ccc(cc1)-c1ccc(Cl)cc1)C(F)(F)F)C(F)(F)F
InChI Key InChIKey=SVGFNDGOCQKUNY-UHFFFAOYSA-N
Data  1 KI
  Tab Delimited (TSV)   2D SDfile   Computed 3D by Vconf -m prep SDfile
Find this compound or compounds like it in BindingDB:
Activity Spreadsheet -- Enzyme Inhibition Constant Data from BindingDB
Found 1 hit for monomerid = 123579
TargetGlucagon receptor(Homo sapiens (Human))
Janssen Pharmaceutica
US Patent
LigandPNGBDBM123579(US8748624, 71)
Affinity DataKi:  31.3nMpH: 7.4Assay Description:The binding assay was performed by a filtration method in a 384 well format. Membranes at a final protein concentration of 6 μg/well were incuba...
In DepthDetails US Patent